{"text_format":"1","workbook":"xlsx","n_sheets":7,"sheets":["Facility Data","Facility Info","Weighted","Facility Cover Sheet","Tally Sheet","Parts List","US. Speed Sheet"],"not_rendered":{"charts":0,"images":1,"macros":1,"external_links":0,"defined_names":22,"comments":0,"pivot_tables":0},"unopened":[],"bounds":{"document_bytes":16777216,"sheet_cells":100000,"rows_first":2000,"rows_last":500,"rows_between":2000,"halvings":0,"cell_chars":16384,"cell_head_chars":4096},"cells_cut":0,"cells_raw":0,"read":"whole","date_system":"1900"}

{"sheet":"Facility Data","index":0,"n_rows":153,"n_cols":6,"rows_kept":153,"cut":false,"hidden":true,"merged":[]}
[null,null,null,"CONTRACTOR LIST"]
[]
["Staff",null,null,"AA"]
[null,null,null,"AMERICAN AUTO WORKS"]
[" ",null,null,"AMPORTS"]
["PB",null,null,"APLS"]
["DH",null,null,"ATC LOGISTICS"]
["CM",null,null,"AUTO RELEASING INC."]
["PB, DH, CM",null,null,"AUTO WAREHOUSING CO"]
["PB, DH ",null,null,"AUTOPORT LTD."]
{"$rows_left_out":144}
{"sheet":"Facility Info","index":1,"n_rows":27,"n_cols":98,"rows_kept":27,"cut":false,"hidden":false,"merged":[[0,0,0,1],[2,0,2,1],[1,0,1,1]]}
["ORIGIN QUALITY REVIEW"]
["OFFICE 2010 (EXCEL) 2020",null,null,null,null,null,null,null,null,null,null,null,null,null,null,null,null,null,null,null,null,null,null,null,null,null,null,null,null,null,null,null,null,null,null,null,null,null,null,null,null,null,null,null,null,null,null,null,null,null,null,null,null,null,null,null,null,null,null,null,null,null,null,null,null,null,null,null,null,null,null,null,null,null,null,null,null,null,null,null,null,null,null,null,null,null,null,null,null,null,null,null,null,null,null,null,null,{"$f":"('Facility Info'!B14)","v":" "}]
["FACILITY INFORMATION SHEET"]
["Date Quality Review Was Completed:"]
["City:"]
["State or Country:"]
["Manufacturer:"]
["Contractor Name:"]
["Cover Sheet Railroad  Abbreviation:"," "]
["Railroad Responsible For Mechanical:"," "]
{"$rows_left_out":18}
{"sheet":"Weighted","index":2,"n_rows":50,"n_cols":9,"rows_kept":50,"cut":false,"hidden":true,"merged":[]}
[]
[]
[]
[]
[]
["Question","Weight","Possible","Wted Score",null,"Question","Weight","Possible","Wted Score"]
["MECHANICAL - Weight 22%",null,{"$f":"SUM(C9:C24)+SUM(C26:C33)","v":{"$error":"#DIV/0!"}},{"$f":"(SUM(D9:D24)+SUM(D26:D33))/(C7)","v":{"$error":"#DIV/0!"}},null,"  2. Obey all Posted Traffic Regs. /Observe Safe Driving",3,{"$f":"IF(I7=\"N/A\",\"N/A\",1*G7)","v":{"$error":"#DIV/0!"}},{"$f":"IF('Facility Cover Sheet'!G7=\"N/A\",\"N/A\",'Facility Cover Sheet'!G7*G7)","v":{"$error":"#DIV/0!"}}]
["A. MULTI-LEVEL MAINTENANCE",{"$f":"SUM(B9:B24)","v":35},{"$f":"SUM(C9:C24)","v":{"$error":"#DIV/0!"}},{"$f":"(SUM(D9:D24))/C8","v":{"$error":"#DIV/0!"}},null,"  3. One Car Length Maintained Between Vehicles",2,{"$error":"#DIV/0!"},{"$f":"IF('Facility Cover Sheet'!G8=\"N/A\",\"N/A\",'Facility Cover Sheet'!G8*G8)","v":{"$error":"#DIV/0!"}}]
["  1. Multi-Level Inspected/Repaired",2,{"$f":"IF(D9=\"N/A\",\"N/A\",1*B9)","v":{"$error":"#DIV/0!"}},{"$f":"IF('Facility Cover Sheet'!A8=\"N/A\",\"N/A\",'Facility Cover Sheet'!A8*B9)","v":{"$error":"#DIV/0!"}},null,"  4. Seat and Floor Protection Positioned",2,{"$error":"#DIV/0!"},{"$f":"IF('Facility Cover Sheet'!G9=\"N/A\",\"N/A\",'Facility Cover Sheet'!G9*G9)","v":{"$error":"#DIV/0!"}}]
["  2. Maintenance Equipment Available",1,{"$f":"IF(D10=\"N/A\",\"N/A\",1*B10)","v":1},{"$f":"IF('Facility Cover Sheet'!A9=\"N/A\",\"N/A\",'Facility Cover Sheet'!A9*B10)","v":0},null,"  6. Tires on Line",2,{"$error":"#DIV/0!"},{"$f":"IF('Facility Cover Sheet'!G10=\"N/A\",\"N/A\",'Facility Cover Sheet'!G10*G10)","v":{"$error":"#DIV/0!"}}]
{"$rows_left_out":41}
{"sheet":"Facility Cover Sheet","index":3,"n_rows":48,"n_cols":11,"rows_kept":48,"cut":false,"hidden":false,"merged":[[3,2,3,5],[0,0,0,10],[2,0,2,1],[2,2,2,5],[3,0,3,1],[1,0,1,2],[1,4,1,5],[2,6,3,7],[2,8,3,10],[4,6,4,7],[5,6,5,7],[5,8,5,10],[37,7,37,9],[48,6,49,7],[48,0,48,5],[5,1,5,5],[31,1,31,5],[37,1,37,5],[4,0,4,1],[4,2,4,5]]}
["AAR ORIGIN QUALITY REVIEW"]
["OVERALL SCORE",null,null,null,{"$f":"(Weighted!D7*0.22)+(Weighted!D34*0.17)+(Weighted!D41*0.08)+(Weighted!D49*0.09)+(Weighted!I16*0.17)+(Weighted!I32*0.2)+(Weighted!I38*0.07)","v":{"$error":"#DIV/0!"}}]
["Location:",null,{"$f":"(#REF!)","v":{"$error":"#REF!"}},null,null,null,"Contractor:",null,{"$f":"('Facility Info'!B8)","v":0}]
["Railroad:",null,{"$f":"(#REF!)","v":{"$error":"#REF!"}}]
["Manufactuer:",null,{"$f":"('Facility Info'!B7)","v":0},null,null,null,"Ramp Code:",null," "," "]
[{"$f":"(Weighted!D7)","v":{"$error":"#DIV/0!"}},"MECHANICAL- Weight 22%",null,null,null,null,"Date:",null,{"$f":"('Facility Info'!B4)","v":"00:00:00"}]
[{"$f":"(Weighted!D8)","v":{"$error":"#DIV/0!"}},"A. MULTI-LEVEL MAINTENANCE",null,null,null,null,{"$f":"TRUNC(('Tally Sheet'!DJ34),4)","v":{"$error":"#DIV/0!"}},"  2. Obey all Posted Traffic Regs. /Safe Driving",null,null,"A"]
[{"$f":"TRUNC(('Tally Sheet'!A17),4)","v":{"$error":"#DIV/0!"}},"  1. Multi-Level Inspected/Repaired",null,null,null,"B",{"$f":"TRUNC(('Tally Sheet'!DP34),4)","v":{"$error":"#DIV/0!"}},"  3. One Car Length Maintained Between Vehicles",null,null,"B"]
[{"$f":"TRUNC(('Tally Sheet'!G17),4)","v":0},"  2. Maintenance Equipment Available",null,null,null,"C",{"$f":"TRUNC(('Tally Sheet'!DW34),4)","v":{"$error":"#DIV/0!"}},"  4. Seat and Floor Protection Positioned",null,null,"B"]
[{"$f":"TRUNC(('Tally Sheet'!N17),4)","v":{"$error":"#DIV/0!"}},"  3. Tie-Down/Chock Lubrication",null,null,null,"C",{"$f":"TRUNC(('Tally Sheet'!A51),4)","v":{"$error":"#DIV/0!"}},"  5. Tires on Line",null,null,"B"]
{"$rows_left_out":39}
{"sheet":"Tally Sheet","index":4,"n_rows":308,"n_cols":130,"rows_kept":308,"cut":false,"hidden":false,"merged":[[63,96,63,97],[24,52,24,53],[25,52,25,53],[26,52,26,53],[27,52,27,53],[63,90,63,91],[59,75,59,76],[58,75,58,76],[56,52,56,53],[61,90,61,91],[52,90,52,91],[53,90,53,91],[54,90,54,91],[57,90,57,91],[58,90,58,91],[59,90,59,91],[61,117,61,118],[52,96,52,97],[53,96,53,97],[54,96,54,97],[55,96,55,97],[56,96,56,97],[57,96,57,97],[58,96,58,97],[59,96,59,97],[60,96,60,97],[61,96,61,97],[52,117,52,118],[53,117,53,118],[54,117,54,118],[55,117,55,118],[60,117,60,118],[60,90,60,91],[24,37,24,38],[41,103,41,104],[42,103,42,104],[43,103,43,104],[44,103,44,104],[36,103,36,104],[37,103,37,104],[38,103,38,104],[39,103,39,104],[40,103,40,104],[17,106,17,111],[55,37,55,38],[56,37,56,38],[39,37,39,38],[40,37,40,38],[25,60,25,61],[26,60,26,61],[27,60,27,61],[35,103,35,104],[55,45,55,46],[56,45,56,46],[22,110,22,111],[55,90,55,91],[56,90,56,91],[55,52,55,53],[23,60,23,61],[39,30,39,31],[40,30,40,31],[5,103,5,104],[6,103,6,104],[22,52,22,53],[23,52,23,53],[22,45,22,46],[23,45,23,46],[17,99,17,104],[22,103,22,104],[22,60,22,61],[17,92,17,97],[23,30,23,31],[24,30,24,31],[24,60,24,61],[23,37,23,38]]}
["A1 MECH  MULTI-LEVEL INSPT/REPAIR",null,null,null,null,null,"A2 MECH  MAINT MATERIALS AVILABLE",null,null,null,null,null,null,"A3 MECH  TIE-DOWN/CHOCK LUBE",null,null,null,null,null,"A4 MECH  TIE-DOWN/CHOCK COND",null,null,null,null,null,null,"A5 MECH  HOOKS/HARNESSES CONDITION",null,null,null,null,null,null,"A6 MECH  CHOCKS/HARNESSES PROPERLY STORED",null,null,null,null,null,null,null,"A7 MECH  BRIDGE PLATE SUPPORT CONDITION",null,null,null,null,null,null,"A8 MECH  TIE-DOWN/CHOCK TRACK/GRATE COND.",null,null,null,null,null,null,null,"A9 MECH  DOOR EDGE CONDITION",null,null,null,null,null,null,"A10 MECH  HINGED DECK CONDITION",null,null,null,null,null,null,null,"A11 MECH  DECK CLEAN",null,null,null,null,null,null,"A12 MECH  SIDE PANEL CONDITION",null,null,null,null,null,null,null,"A13 MECH  END DOOR CONDITION",null,null,null,null,null,"A14 MECH  END DOOR LUBRICATION",null,null,null,null,null,null," A15 MECH CERTIFIED INSPECTOR AT FACILITY",null,null,null,null,null,null," B1 END DOORS OPEN AND STORED",null,null,null,null,null,null," B2 HINGED DECKS RAISED AND LOCKED PRIOR TO LOADING",null,null,null,null,null," B3 BRIDGE PLATES HINGED AT HIGHER DECK",null,null,null,null,null,null,"B4 PROPER B/PLATES USED AT M/L JUNCTIONS"]
[null,null,{"$f":"ROUND((A2/B2),4)","v":{"$error":"#DIV/0!"}},{"$f":"(#REF!)","v":{"$error":"#REF!"}},null,null,{"$f":"'Parts List'!L3","v":0},{"$f":"'Parts List'!M3","v":11},{"$f":"ROUND((G2/H2),4)","v":0},1,null,null,null,null,null,{"$f":"ROUND((N2/O2),4)","v":{"$error":"#DIV/0!"}},{"$f":"(#REF!)","v":{"$error":"#REF!"}},null,null,null,null,{"$f":"ROUND((T2/U2),4)","v":{"$error":"#DIV/0!"}},{"$f":"(#REF!)","v":{"$error":"#REF!"}},null,null,null,null,null,{"$f":"ROUND((AA2/AB2),4)","v":{"$error":"#DIV/0!"}},{"$f":"(#REF!)","v":{"$error":"#REF!"}},null,null,null,null,null,{"$f":"ROUND((AH2/AI2),4)","v":{"$error":"#DIV/0!"}},{"$f":"(#REF!)","v":{"$error":"#REF!"}},null,null,null,null,null,null,{"$f":"ROUND((AP2/AQ2),4)","v":{"$error":"#DIV/0!"}},{"$f":"(#REF!)","v":{"$error":"#REF!"}},null,null,null,null,null,{"$f":"ROUND((AW2/AX2),4)","v":{"$error":"#DIV/0!"}},{"$f":"(#REF!)","v":{"$error":"#REF!"}},null,null,null,null,null,null,{"$f":"ROUND((BE2/BF2),4)","v":{"$error":"#DIV/0!"}},{"$f":"(#REF!)","v":{"$error":"#REF!"}},null,null,null,null,null,{"$f":"ROUND((BL2/BM2),4)","v":{"$error":"#DIV/0!"}},{"$f":"(#REF!)","v":{"$error":"#REF!"}},null,null,null,null,null,null,{"$f":"ROUND((BT2/BU2),4)","v":{"$error":"#DIV/0!"}},{"$f":"(#REF!)","v":{"$error":"#REF!"}},null,null,null,null,null,{"$f":"ROUND((CA2/CB2),4)","v":{"$error":"#DIV/0!"}},{"$f":"(#REF!)","v":{"$error":"#REF!"}},null,null,null,null,null,null,{"$f":"ROUND((CI2/CJ2),4)","v":{"$error":"#DIV/0!"}},{"$f":"(#REF!)","v":{"$error":"#REF!"}},null,null,null,null,{"$f":"ROUND((CO2/CP2),4)","v":{"$error":"#DIV/0!"}},{"$f":"(#REF!)","v":{"$error":"#REF!"}},null,null,null,null,null,{"$f":"ROUND((CV2/CW2),4)","v":{"$error":"#DIV/0!"}},{"$f":"(#REF!)","v":{"$error":"#REF!"}},null,null,null,null,null,{"$f":"ROUND((DC2/DD2),4)","v":{"$error":"#DIV/0!"}},{"$f":"(#REF!)","v":{"$error":"#REF!"}},null,null,null,null,null,{"$f":"ROUND((DJ2/DK2),4)","v":{"$error":"#DIV/0!"}},{"$f":"(#REF!)","v":{"$error":"#REF!"}},null,null,null,null,{"$f":"ROUND((DP2/DQ2),4)","v":{"$error":"#DIV/0!"}},{"$f":"(#REF!)","v":{"$error":"#REF!"}},null,null,null,null,null,{"$f":"ROUND((DW2/DX2),4)","v":{"$error":"#DIV/0!"}},{"$f":"(#REF!)","v":{"$error":"#REF!"}}]
[null,null,{"$error":"#DIV/0!"},{"$f":"(#REF!)","v":{"$error":"#REF!"}},null,null,null,null,2,2,null,null,null,null,null,{"$error":"#DIV/0!"},{"$f":"(#REF!)","v":{"$error":"#REF!"}},null,null,null,null,{"$error":"#DIV/0!"},{"$f":"(#REF!)","v":{"$error":"#REF!"}},null,null,null,null,null,{"$error":"#DIV/0!"},{"$f":"(#REF!)","v":{"$error":"#REF!"}},null,null,null,null,null,{"$error":"#DIV/0!"},{"$f":"(#REF!)","v":{"$error":"#REF!"}},null,null,null,null,null,null,{"$error":"#DIV/0!"},{"$f":"(#REF!)","v":{"$error":"#REF!"}},null,null,null,null,null,{"$error":"#DIV/0!"},{"$f":"(#REF!)","v":{"$error":"#REF!"}},null,null,null,null,null,null,{"$error":"#DIV/0!"},{"$f":"(#REF!)","v":{"$error":"#REF!"}},null,null,null,null,null,{"$error":"#DIV/0!"},{"$f":"(#REF!)","v":{"$error":"#REF!"}},null,null,null,null,null,null,{"$error":"#DIV/0!"},{"$f":"(#REF!)","v":{"$error":"#REF!"}},null,null,null,null,null,{"$error":"#DIV/0!"},{"$f":"(#REF!)","v":{"$error":"#REF!"}},null,null,null,null,null,null,{"$error":"#DIV/0!"},{"$f":"(#REF!)","v":{"$error":"#REF!"}},null,null,null,null,{"$error":"#DIV/0!"},{"$f":"(#REF!)","v":{"$error":"#REF!"}},null,null,null,null,null,{"$error":"#DIV/0!"},{"$f":"(#REF!)","v":{"$error":"#REF!"}},null,null,null,null,null,{"$error":"#DIV/0!"},{"$f":"(#REF!)","v":{"$error":"#REF!"}},null,null,null,null,null,{"$error":"#DIV/0!"},{"$f":"(#REF!)","v":{"$error":"#REF!"}},null,null,null,null,{"$error":"#DIV/0!"},{"$f":"(#REF!)","v":{"$error":"#REF!"}},null,null,null,null,null,{"$error":"#DIV/0!"},{"$f":"(#REF!)","v":{"$error":"#REF!"}}]
[null,null,{"$error":"#DIV/0!"},{"$f":"(#REF!)","v":{"$error":"#REF!"}},null,null,null,null,3,3,null,null,null,null,null,{"$error":"#DIV/0!"},{"$f":"(#REF!)","v":{"$error":"#REF!"}},null,null,null,null,{"$error":"#DIV/0!"},{"$f":"(#REF!)","v":{"$error":"#REF!"}},null,null,null,null,null,{"$error":"#DIV/0!"},{"$f":"(#REF!)","v":{"$error":"#REF!"}},null,null,null,null,null,{"$error":"#DIV/0!"},{"$f":"(#REF!)","v":{"$error":"#REF!"}},null,null,null,null,null,null,{"$error":"#DIV/0!"},{"$f":"(#REF!)","v":{"$error":"#REF!"}},null,null,null,null,null,{"$error":"#DIV/0!"},{"$f":"(#REF!)","v":{"$error":"#REF!"}},null,null,null,null,null,null,{"$error":"#DIV/0!"},{"$f":"(#REF!)","v":{"$error":"#REF!"}},null,null,null,null,null,{"$error":"#DIV/0!"},{"$f":"(#REF!)","v":{"$error":"#REF!"}},null,null,null,null,null,null,{"$error":"#DIV/0!"},{"$f":"(#REF!)","v":{"$error":"#REF!"}},null,null,null,null,null,{"$error":"#DIV/0!"},{"$f":"(#REF!)","v":{"$error":"#REF!"}},null,null,null,null,null,null,{"$error":"#DIV/0!"},{"$f":"(#REF!)","v":{"$error":"#REF!"}},null,null,null,null,{"$error":"#DIV/0!"},{"$f":"(#REF!)","v":{"$error":"#REF!"}},null,null,null,null,null,{"$error":"#DIV/0!"},{"$f":"(#REF!)","v":{"$error":"#REF!"}},null,null,null,null,null,{"$error":"#DIV/0!"},{"$f":"(#REF!)","v":{"$error":"#REF!"}},null,null,null,null,null,{"$error":"#DIV/0!"},{"$f":"(#REF!)","v":{"$error":"#REF!"}},null,null,null,null,{"$error":"#DIV/0!"},{"$f":"(#REF!)","v":{"$error":"#REF!"}},null,null,null,null,null,{"$error":"#DIV/0!"},{"$f":"(#REF!)","v":{"$error":"#REF!"}}]
[null,null,{"$error":"#DIV/0!"},{"$f":"(#REF!)","v":{"$error":"#REF!"}},null,null,null,null,4,4,null,null,null,null,null,{"$error":"#DIV/0!"},{"$f":"(#REF!)","v":{"$error":"#REF!"}},null,null,null,null,{"$error":"#DIV/0!"},{"$f":"(#REF!)","v":{"$error":"#REF!"}},null,null,null,null,null,{"$error":"#DIV/0!"},{"$f":"(#REF!)","v":{"$error":"#REF!"}},null,null,null,null,null,{"$error":"#DIV/0!"},{"$f":"(#REF!)","v":{"$error":"#REF!"}},null,null,null,null,null,null,{"$error":"#DIV/0!"},{"$f":"(#REF!)","v":{"$error":"#REF!"}},null,null,null,null,null,{"$error":"#DIV/0!"},{"$f":"(#REF!)","v":{"$error":"#REF!"}},null,null,null,null,null,null,{"$error":"#DIV/0!"},{"$f":"(#REF!)","v":{"$error":"#REF!"}},null,null,null,null,null,{"$error":"#DIV/0!"},{"$f":"(#REF!)","v":{"$error":"#REF!"}},null,null,null,null,null,null,{"$error":"#DIV/0!"},{"$f":"(#REF!)","v":{"$error":"#REF!"}},null,null,null,null,null,{"$error":"#DIV/0!"},{"$f":"(#REF!)","v":{"$error":"#REF!"}},null,null,null,null,null,null,{"$error":"#DIV/0!"},{"$f":"(#REF!)","v":{"$error":"#REF!"}},null,null,null,null,{"$error":"#DIV/0!"},{"$f":"(#REF!)","v":{"$error":"#REF!"}},null,null,null,null,null,{"$error":"#DIV/0!"},{"$f":"(#REF!)","v":{"$error":"#REF!"}},null,null,null,null,null,{"$error":"#DIV/0!"},{"$f":"(#REF!)","v":{"$error":"#REF!"}},null,null,null,null,null,{"$error":"#DIV/0!"},{"$f":"(#REF!)","v":{"$error":"#REF!"}},null,null,null,null,{"$error":"#DIV/0!"},{"$f":"(#REF!)","v":{"$error":"#REF!"}},null,null,null,null,null,{"$error":"#DIV/0!"},{"$f":"(#REF!)","v":{"$error":"#REF!"}}]
[null,null,{"$error":"#DIV/0!"},{"$f":"(#REF!)","v":{"$error":"#REF!"}},null,null,null,null,5,5,null,null,null,null,null,{"$error":"#DIV/0!"},{"$f":"(#REF!)","v":{"$error":"#REF!"}},null,null,null,null,{"$error":"#DIV/0!"},{"$f":"(#REF!)","v":{"$error":"#REF!"}},null,null,null,null,null,{"$error":"#DIV/0!"},{"$f":"(#REF!)","v":{"$error":"#REF!"}},null,null,null,null,null,{"$error":"#DIV/0!"},{"$f":"(#REF!)","v":{"$error":"#REF!"}},null,null,null,null,null,null,{"$error":"#DIV/0!"},{"$f":"(#REF!)","v":{"$error":"#REF!"}},null,null,null,null,null,{"$error":"#DIV/0!"},{"$f":"(#REF!)","v":{"$error":"#REF!"}},null,null,null,null,null,null,{"$error":"#DIV/0!"},{"$f":"(#REF!)","v":{"$error":"#REF!"}},null,null,null,null,null,{"$error":"#DIV/0!"},{"$f":"(#REF!)","v":{"$error":"#REF!"}},null,null,null,null,null,null,{"$error":"#DIV/0!"},{"$f":"(#REF!)","v":{"$error":"#REF!"}},null,null,null,null,null,{"$error":"#DIV/0!"},{"$f":"(#REF!)","v":{"$error":"#REF!"}},null,null,null,null,null,null,{"$error":"#DIV/0!"},{"$f":"(#REF!)","v":{"$error":"#REF!"}},null,null,null,null,{"$error":"#DIV/0!"},{"$f":"(#REF!)","v":{"$error":"#REF!"}},null,null,null,null,null,{"$error":"#DIV/0!"},{"$f":"(#REF!)","v":{"$error":"#REF!"}},"Mech section\"A\" Multi-Level Maint.",null,null,null,null,{"$error":"#DIV/0!"},{"$f":"(#REF!)","v":{"$error":"#REF!"}},null,null,null,null,null,{"$error":"#DIV/0!"},{"$f":"(#REF!)","v":{"$error":"#REF!"}},null,null,null,null,{"$error":"#DIV/0!"},{"$f":"(#REF!)","v":{"$error":"#REF!"}},null,null,null,null,null,{"$error":"#DIV/0!"},{"$f":"(#REF!)","v":{"$error":"#REF!"}}]
[null,null,{"$error":"#DIV/0!"},{"$f":"(#REF!)","v":{"$error":"#REF!"}},null,null,null,null,6,6,null,null,null,null,null,{"$error":"#DIV/0!"},{"$f":"(#REF!)","v":{"$error":"#REF!"}},null,null,null,null,{"$error":"#DIV/0!"},{"$f":"(#REF!)","v":{"$error":"#REF!"}},null,null,null,null,null,{"$error":"#DIV/0!"},{"$f":"(#REF!)","v":{"$error":"#REF!"}},null,null,null,null,null,{"$error":"#DIV/0!"},{"$f":"(#REF!)","v":{"$error":"#REF!"}},null,null,null,null,null,null,{"$error":"#DIV/0!"},{"$f":"(#REF!)","v":{"$error":"#REF!"}},null,null,null,null,null,{"$error":"#DIV/0!"},{"$f":"(#REF!)","v":{"$error":"#REF!"}},null,null,null,null,null,null,{"$error":"#DIV/0!"},{"$f":"(#REF!)","v":{"$error":"#REF!"}},null,null,null,null,null,{"$error":"#DIV/0!"},{"$f":"(#REF!)","v":{"$error":"#REF!"}},null,null,null,null,null,null,{"$error":"#DIV/0!"},{"$f":"(#REF!)","v":{"$error":"#REF!"}},null,null,null,null,null,{"$error":"#DIV/0!"},{"$f":"(#REF!)","v":{"$error":"#REF!"}},null,null,null,null,null,null,{"$error":"#DIV/0!"},{"$f":"(#REF!)","v":{"$error":"#REF!"}},null,null,null,null,{"$error":"#DIV/0!"},{"$f":"(#REF!)","v":{"$error":"#REF!"}},null,null,null,null,null,{"$error":"#DIV/0!"},{"$f":"(#REF!)","v":{"$error":"#REF!"}},{"$f":"('Facility Cover Sheet'!A6)","v":{"$error":"#DIV/0!"}},null,null,null,null,{"$error":"#DIV/0!"},{"$f":"(#REF!)","v":{"$error":"#REF!"}},null,null,null,null,null,{"$error":"#DIV/0!"},{"$f":"(#REF!)","v":{"$error":"#REF!"}},null,null,null,null,{"$error":"#DIV/0!"},{"$f":"(#REF!)","v":{"$error":"#REF!"}},null,null,null,null,null,{"$error":"#DIV/0!"},{"$f":"(#REF!)","v":{"$error":"#REF!"}}]
[null,null,{"$error":"#DIV/0!"},{"$f":"(#REF!)","v":{"$error":"#REF!"}},null,null,null,null,7,7,null,null,null,null,null,{"$error":"#DIV/0!"},{"$f":"(#REF!)","v":{"$error":"#REF!"}},null,null,null,null,{"$error":"#DIV/0!"},{"$f":"(#REF!)","v":{"$error":"#REF!"}},null,null,null,null,null,{"$error":"#DIV/0!"},{"$f":"(#REF!)","v":{"$error":"#REF!"}},null,null,null,null,null,{"$error":"#DIV/0!"},{"$f":"(#REF!)","v":{"$error":"#REF!"}},null,null,null,null,null,null,{"$error":"#DIV/0!"},{"$f":"(#REF!)","v":{"$error":"#REF!"}},null,null,null,null,null,{"$error":"#DIV/0!"},{"$f":"(#REF!)","v":{"$error":"#REF!"}},null,null,null,null,null,null,{"$error":"#DIV/0!"},{"$f":"(#REF!)","v":{"$error":"#REF!"}},null,null,null,null,null,{"$error":"#DIV/0!"},{"$f":"(#REF!)","v":{"$error":"#REF!"}},null,null,null,null,null,null,{"$error":"#DIV/0!"},{"$f":"(#REF!)","v":{"$error":"#REF!"}},null,null,null,null,null,{"$error":"#DIV/0!"},{"$f":"(#REF!)","v":{"$error":"#REF!"}},null,null,null,null,null,null,{"$error":"#DIV/0!"},{"$f":"(#REF!)","v":{"$error":"#REF!"}},null,null,null,null,{"$error":"#DIV/0!"},{"$f":"(#REF!)","v":{"$error":"#REF!"}},null,null,null,null,null,{"$error":"#DIV/0!"},{"$f":"(#REF!)","v":{"$error":"#REF!"}},null,null,null,null,null,{"$error":"#DIV/0!"},{"$f":"(#REF!)","v":{"$error":"#REF!"}},null,null,null,null,null,{"$error":"#DIV/0!"},{"$f":"(#REF!)","v":{"$error":"#REF!"}},null,null,null,null,{"$error":"#DIV/0!"},{"$f":"(#REF!)","v":{"$error":"#REF!"}},null,null,null,null,null,{"$error":"#DIV/0!"},{"$f":"(#REF!)","v":{"$error":"#REF!"}}]
[null,null,{"$error":"#DIV/0!"},{"$f":"(#REF!)","v":{"$error":"#REF!"}},null,null,null,null,8,8,null,null,null,null,null,{"$error":"#DIV/0!"},{"$f":"(#REF!)","v":{"$error":"#REF!"}},null,null,null,null,{"$error":"#DIV/0!"},{"$f":"(#REF!)","v":{"$error":"#REF!"}},null,null,null,null,null,{"$error":"#DIV/0!"},{"$f":"(#REF!)","v":{"$error":"#REF!"}},null,null,null,null,null,{"$error":"#DIV/0!"},{"$f":"(#REF!)","v":{"$error":"#REF!"}},null,null,null,null,null,null,{"$error":"#DIV/0!"},{"$f":"(#REF!)","v":{"$error":"#REF!"}},null,null,null,null,null,{"$error":"#DIV/0!"},{"$f":"(#REF!)","v":{"$error":"#REF!"}},null,null,null,null,null,null,{"$error":"#DIV/0!"},{"$f":"(#REF!)","v":{"$error":"#REF!"}},null,null,null,null,null,{"$error":"#DIV/0!"},{"$f":"(#REF!)","v":{"$error":"#REF!"}},null,null,null,null,null,null,{"$error":"#DIV/0!"},{"$f":"(#REF!)","v":{"$error":"#REF!"}},null,null,null,null,null,{"$error":"#DIV/0!"},{"$f":"(#REF!)","v":{"$error":"#REF!"}},null,null,null,null,null,null,{"$error":"#DIV/0!"},{"$f":"(#REF!)","v":{"$error":"#REF!"}},null,null,null,null,{"$error":"#DIV/0!"},{"$f":"(#REF!)","v":{"$error":"#REF!"}},null,null,null,null,null,{"$error":"#DIV/0!"},{"$f":"(#REF!)","v":{"$error":"#REF!"}},null,null,null,null,null,{"$error":"#DIV/0!"},{"$f":"(#REF!)","v":{"$error":"#REF!"}},null,null,null,null,null,{"$error":"#DIV/0!"},{"$f":"(#REF!)","v":{"$error":"#REF!"}},null,null,null,null,{"$error":"#DIV/0!"},{"$f":"(#REF!)","v":{"$error":"#REF!"}},null,null,null,null,null,{"$error":"#DIV/0!"},{"$f":"(#REF!)","v":{"$error":"#REF!"}}]
[null,null,{"$error":"#DIV/0!"},{"$f":"(#REF!)","v":{"$error":"#REF!"}},null,null,null,null,9,9,null,null,null,null,null,{"$error":"#DIV/0!"},{"$f":"(#REF!)","v":{"$error":"#REF!"}},null,null,null,null,{"$error":"#DIV/0!"},{"$f":"(#REF!)","v":{"$error":"#REF!"}},null,null,null,null,null,{"$error":"#DIV/0!"},{"$f":"(#REF!)","v":{"$error":"#REF!"}},null,null,null,null,null,{"$error":"#DIV/0!"},{"$f":"(#REF!)","v":{"$error":"#REF!"}},null,null,null,null,null,null,{"$error":"#DIV/0!"},{"$f":"(#REF!)","v":{"$error":"#REF!"}},null,null,null,null,null,{"$error":"#DIV/0!"},{"$f":"(#REF!)","v":{"$error":"#REF!"}},null,null,null,null,null,null,{"$error":"#DIV/0!"},{"$f":"(#REF!)","v":{"$error":"#REF!"}},null,null,null,null,null,{"$error":"#DIV/0!"},{"$f":"(#REF!)","v":{"$error":"#REF!"}},null,null,null,null,null,null,{"$error":"#DIV/0!"},{"$f":"(#REF!)","v":{"$error":"#REF!"}},null,null,null,null,null,{"$error":"#DIV/0!"},{"$f":"(#REF!)","v":{"$error":"#REF!"}},null,null,null,null,null,null,{"$error":"#DIV/0!"},{"$f":"(#REF!)","v":{"$error":"#REF!"}},null,null,null,null,{"$error":"#DIV/0!"},{"$f":"(#REF!)","v":{"$error":"#REF!"}},null,null,null,null,null,{"$error":"#DIV/0!"},{"$f":"(#REF!)","v":{"$error":"#REF!"}},null,null,null,null,null,{"$error":"#DIV/0!"},{"$f":"(#REF!)","v":{"$error":"#REF!"}},null,null,null,null,null,{"$error":"#DIV/0!"},{"$f":"(#REF!)","v":{"$error":"#REF!"}},null,null,null,null,{"$error":"#DIV/0!"},{"$f":"(#REF!)","v":{"$error":"#REF!"}},null,null,null,null,null,{"$error":"#DIV/0!"},{"$f":"(#REF!)","v":{"$error":"#REF!"}}]
{"$rows_left_out":299}
{"sheet":"Parts List","index":5,"n_rows":24,"n_cols":145,"rows_kept":24,"cut":false,"hidden":false,"merged":[[0,0,0,3],[1,0,1,5]]}
["Mech. Question Number 1 Tools & Material",null,null,null,null,null,null,null,null,null,null,{"$f":"COUNTIF((B3:B8),\"x\")","v":0},{"$f":"COUNTIF((D3:D7),\"x\")","v":0}]
[null,null,null,null,null,null,null,null,null,null,null,null,null,null,null,null,null,null,null,null,null,null,null,null,null,null,null,null,null,null,null,null,null,null,null,null,null,null,null,null,null,null,null,null,null,null,null,null,null,null,null,null,null,null,null,null,null,null,null,null,null,null,null,null,null,null,null,null,null,null,null,null,null,null,null,null,null,null,null,null,null,null,null,null,null,null,null,null,null,null,null,null,null,null,null,null,null,null,null,null,null,null,null,null,null,null,null,null,null,null,null,null,null,null,null,null,null,null,null,null,null,null,null,null,null,null,null,null,null,null,null,null,null,null,null,null,null,null,null,null,null,null,null,null,{"$f":"('Parts List'!B15)","v":0}]
["Grease Gun/Sprayer",null,"Ladder"," ",null,null,null,null,null,null,null,{"$f":"((L1)+(M1))","v":0},11]
["Operation Plan"," ","Broom/Shovel"," ",null,null,null,null,null,null,null,{"$f":"((L3)/(M3))","v":0}]
["Welder"," ","Blower"," "]
["Hand Tools"," ","Torch"," "]
["AWS D15.1 Welder Certification"," ","Manual"," "]
["Material Missing or not Meeting Current Specifications"," "]
[]
[]
{"$rows_left_out":15}
{"sheet":"US. Speed Sheet","index":6,"n_rows":55,"n_cols":12,"rows_kept":55,"cut":false,"hidden":false,"merged":[[4,1,4,4],[3,3,3,4],[0,0,0,4]]}
["ALL SPEEDS CALQULATED IN MPH",null,null,null,null,null,null,20]
["SPEEDS OF VEHICLES THROUGH FROM RELEASE GATE THROUGH STORAGE/RAMP AREA AND RAILCARS"]
[]
["Ramp Code: ",null,"Date: ",{"$f":"#REF!","v":{"$error":"#REF!"}}]
[null,"Place Posted Speed in Space Provided Below"]
["Release Gate =",null,"Storage and Ramp =",15,"Through RailCars =",5]
[]
["Release Gate ( Speeds MPH)",null,"Storage and Ramp (Speeds MPH)",null,"Through RailCars (Speeds MPH)"]
["Time Sec.","Speed (mph)","Time Sec.","Speed (mph)","Time Sec.","Speed (mph)"]
[null,{"$f":"IF(A10=0,\"NA\",ROUNDDOWN(61/A10,0))","v":"NA"},null,{"$f":"IF(C10=0,\"NA\",ROUNDDOWN(61/C10,0))","v":"NA"},null,{"$f":"IF(E10=0,\"NA\",ROUNDDOWN(61/E10,0))","v":"NA"},null,{"$f":"IF((D10)>(D6),(D10),(\"ERR\"))","v":"NA"},null,{"$f":"IF((F10)>F6,(F10),(\"ERR\"))","v":"NA"},null,{"$f":"IF((B10)>B6,(B10),(\"ERR\"))","v":"NA"}]
{"$rows_left_out":45}